{"text_format":"1","workbook":"xlsx","n_sheets":13,"sheets":["Stammdaten","Lehrerliste","ZVA","Tabelle5","Prüfungskommissionen","test","Pivot","Schulen","G","Tabelle2","Tabelle1","Tabelle3","Tabelle4"],"not_rendered":{"charts":0,"images":0,"macros":1,"external_links":0,"defined_names":10,"comments":1,"pivot_tables":2},"unopened":[],"bounds":{"document_bytes":16777216,"sheet_cells":100000,"rows_first":2000,"rows_last":500,"rows_between":2000,"halvings":0,"cell_chars":16384,"cell_head_chars":4096},"cells_cut":0,"cells_raw":0,"read":"whole","date_system":"1900"}

{"sheet":"Stammdaten","index":0,"n_rows":300,"n_cols":17,"rows_kept":300,"cut":false,"hidden":false,"merged":[[7,9,7,13],[1,3,1,4],[6,2,6,3],[4,2,4,6],[3,2,3,6],[2,3,2,4]]}
[null,null,null,null,null,null,null,null,null,null,null,null,null,null,null,null,"Vers. 1"]
[null,null,null,"Prüfungsentschädigungen APS/BS/LuF SJ 2023/2024",null,null,null,null,null,null,null,null,null,null,null,"Vers. 1","2017-10-02"]
[null,null,"Zusatztext:",null,null,null,null,null,null,null,null,null,null,null,null,"2024-06-17"]
[]
["Schulkennzahl:",null,{"$f":"IFERROR(IF(B5=\"\",\"\",VLOOKUP(B5,Schulen!$A$1:$D$550,2,FALSE)),\"\")","v":""},null,null,null,null,null,null,null,null,null,null,null,null,{"$f":"IFERROR(IF(B5=\"\",\"\",VLOOKUP(B5,Schulen!Q:R,2,0)),\"\")","v":""}]
["Auszahlungsdatum:",{"$f":"MIN(C10:C300)","v":"00:00:00"},"(wird beim erstellen des ZVA autom. angepasst)",null,{"$f":"SUM(P10:P300)","v":0},null,{"$f":"IF(G8=0,\"ZVA ok\",\"ZVA!!!\")","v":"ZVA ok"}]
["Lohnart:",4811,{"$f":"IF(B7=\"\",\"\",VLOOKUP(B7,Schulen!$H$1:$J$3,2))","v":"Prüfungsentschädigung"},null,{"$f":"ZVA!G4","v":0}]
["Zweckgebundene Gebarung:",{"$f":"IF(B7=4811,\"\",IF(B7=\"\",\"\",IF(B5=\"\",\"\",VLOOKUP(B5,Schulen!$A$1:$G$51,4,0))))","v":""},"Auftrag:",{"$f":"IF(B8=\"\",\"\",\"30W000000002\")","v":""},{"$f":"E6-E7","v":0},null,{"$f":"ROUND(E8,2)","v":0},null,null,{"$f":"SUBTOTAL(9,K10:K300)","v":0}]
["Zu- und Vorname, akad. Grad","Personal-Nr.","Prüfungs-\ndatum","Art der Prüfung","Prüfungstätigkeit","TP","Gegen-\nstand","Klasse","Ausm.\nin %","Std. Proj.","Anz.\nder Kand\n","Art","P","Abg. je\nPr.Kdt.","AJK","Gesamt","G"]
[{"$f":"IF(B10=\"\",\"\",VLOOKUP(B10,Lehrerliste!$A$1:$B$8857,2,0))","v":""},null,null,null,null,null,null,null,null,null,null,{"$f":"IF(D10=\"Reifepr./Diplompr.\",1,IF(D10=\"Abschlussprüfung\",10,IF(D10=\"Vorpr. d. Reifepr./Diplompr./AP\",2,IF(D10=\"Externistenreifeprüfung\",3,IF(D10=\"Zulassungsprüfung z. Extern.RP\",4,IF(D10=\"Sonst. Externistenprüfungen\",5,IF(D10=\"Aufnahms- u. Einstufungsprüfungen\",6,IF(D10=\"Komm. Prüfung/Kolloquien\",7,IF(D10=\"Zertifikatsprüfung Käsek./Jungbark.\",8,IF(D10=\"BRP / Lehre m. Matura\",9,IF(D10=\"Zertifikatsprüfung Weinsommelier\",8,\"\")))))))))))","v":""},{"$f":"IF(E10=\"Vorsitz\",1,IF(E10=\"Vorsitz/mdl. Kompens.\",1,IF(E10=\"Schulleiter/AV/fachk. LP\",1,IF(E10=\"Schulleit./AV/LP/mdl. Komp\",1,IF(E10=\"JV/FV/SK/LP\",1,IF(E10=\"JV/FV/SK/LP/mdl. Komp.\",1,IF(E10=\"Klassenvorstand\",1,IF(E10=\"Klassenvorst./mdl. Komp.\",1,IF(E10=\"Schulleiter/AV/LP\",1,IF(E10=\"KV/FV/SK/LP\",1,\"\"))))))))))","v":""},{"$f":"IFERROR(IF(K10=\"\",\"\",IF(AND(L10=1,M10=1),(O10*F10),IF(AND(L10=11,M10=1),(O10*F10), IF(AND(L10=10,M10=1),(O10*F10),VALUE(O10))))),\"\")","v":""},{"$f":"IF(E10=\"\",\"\",IF(E10=\"Projekt bzw. BDA\",VLOOKUP(J10,G!$V$1:$W$100,2),INDEX(G!$C$2:$C$93,MATCH(Stammdaten!D10&Stammdaten!E10,G!$A$2:$A$93&G!$B$2:$B$93,0))))","v":""},{"$f":"IFERROR(IF(B10=\"\",\"\",IF(K10=\"\",\"0,00\",IF(AND(L10=1,M10=1),VALUE(Q10*F10),IF(AND(L10=11,M10=1),VALUE(Q10*F10),IF(AND(L10=10,M10=1),VALUE(Q10*F10),VALUE(Q10)))))),\"\")","v":""},{"$f":"IF(E10=\"Projekt bzw. BDA\",O10/100*I10*K10,IF(AND(E10=\"Diplomarbeit/Prüfer\",K10>=5),O10/100*I10*5,IF(AND(E10=\"Betreuung bis 5 FBA\",K10>=2),O10/100*I10*1,IF(AND(E10=\"Betreuung FBA/je Prüfer\",K10>=2),O10/100*I10*1,IF(K10<>\"\",(O10/100*I10*K10),IF(K10=\"\",\"\"))))))","v":""}]
[{"$f":"IF(B11=\"\",\"\",VLOOKUP(B11,Lehrerliste!$A$1:$B$8857,2,0))","v":""},null,null,null,null,null,null,null,null,null,null,"","","",{"$f":"IF(E11=\"\",\"\",IF(E11=\"Projekt bzw. BDA\",VLOOKUP(J11,G!$V$1:$W$100,2),INDEX(G!$C$2:$C$93,MATCH(Stammdaten!D11&Stammdaten!E11,G!$A$2:$A$93&G!$B$2:$B$93,0))))","v":""},{"$f":"IFERROR(IF(B11=\"\",\"\",IF(K11=\"\",\"0,00\",IF(AND(L11=1,M11=1),VALUE(Q11*F11),IF(AND(L11=11,M11=1),VALUE(Q11*F11),IF(AND(L11=10,M11=1),VALUE(Q11*F11),VALUE(Q11)))))),\"\")","v":""},{"$f":"IF(E11=\"Projekt bzw. BDA\",O11/100*I11*K11,IF(AND(E11=\"Diplomarbeit/Prüfer\",K11>=5),O11/100*I11*5,IF(AND(E11=\"Betreuung bis 5 FBA\",K11>=2),O11/100*I11*1,IF(AND(E11=\"Betreuung FBA/je Prüfer\",K11>=2),O11/100*I11*1,IF(K11<>\"\",(O11/100*I11*K11),IF(K11=\"\",\"\"))))))","v":""}]
[{"$f":"IF(B12=\"\",\"\",VLOOKUP(B12,Lehrerliste!$A$1:$B$8857,2,0))","v":""},null,null,null,null,null,null,null,null,null,null,"","","",{"$f":"IF(E12=\"\",\"\",IF(E12=\"Projekt bzw. BDA\",VLOOKUP(J12,G!$V$1:$W$100,2),INDEX(G!$C$2:$C$93,MATCH(Stammdaten!D12&Stammdaten!E12,G!$A$2:$A$93&G!$B$2:$B$93,0))))","v":""},"",{"$f":"IF(E12=\"Projekt bzw. BDA\",O12/100*I12*K12,IF(AND(E12=\"Diplomarbeit/Prüfer\",K12>=5),O12/100*I12*5,IF(AND(E12=\"Betreuung bis 5 FBA\",K12>=2),O12/100*I12*1,IF(AND(E12=\"Betreuung FBA/je Prüfer\",K12>=2),O12/100*I12*1,IF(K12<>\"\",(O12/100*I12*K12),IF(K12=\"\",\"\"))))))","v":""}]
[{"$f":"IF(B13=\"\",\"\",VLOOKUP(B13,Lehrerliste!$A$1:$B$8857,2,0))","v":""},null,null,null,null,null,null,null,null,null,null,"","","",{"$f":"IF(E13=\"\",\"\",IF(E13=\"Projekt bzw. BDA\",VLOOKUP(J13,G!$V$1:$W$100,2),INDEX(G!$C$2:$C$93,MATCH(Stammdaten!D13&Stammdaten!E13,G!$A$2:$A$93&G!$B$2:$B$93,0))))","v":""},"",{"$f":"IF(E13=\"Projekt bzw. BDA\",O13/100*I13*K13,IF(AND(E13=\"Diplomarbeit/Prüfer\",K13>=5),O13/100*I13*5,IF(AND(E13=\"Betreuung bis 5 FBA\",K13>=2),O13/100*I13*1,IF(AND(E13=\"Betreuung FBA/je Prüfer\",K13>=2),O13/100*I13*1,IF(K13<>\"\",(O13/100*I13*K13),IF(K13=\"\",\"\"))))))","v":""}]
[{"$f":"IF(B14=\"\",\"\",VLOOKUP(B14,Lehrerliste!$A$1:$B$8857,2,0))","v":""},null,null,null,null,null,null,null,null,null,null,"","","",{"$f":"IF(E14=\"\",\"\",IF(E14=\"Projekt bzw. BDA\",VLOOKUP(J14,G!$V$1:$W$100,2),INDEX(G!$C$2:$C$93,MATCH(Stammdaten!D14&Stammdaten!E14,G!$A$2:$A$93&G!$B$2:$B$93,0))))","v":""},"",{"$f":"IF(E14=\"Projekt bzw. BDA\",O14/100*I14*K14,IF(AND(E14=\"Diplomarbeit/Prüfer\",K14>=5),O14/100*I14*5,IF(AND(E14=\"Betreuung bis 5 FBA\",K14>=2),O14/100*I14*1,IF(AND(E14=\"Betreuung FBA/je Prüfer\",K14>=2),O14/100*I14*1,IF(K14<>\"\",(O14/100*I14*K14),IF(K14=\"\",\"\"))))))","v":""}]
[{"$f":"IF(B15=\"\",\"\",VLOOKUP(B15,Lehrerliste!$A$1:$B$8857,2,0))","v":""},null,null,null,null,null,null,null,null,null,null,"","","",{"$f":"IF(E15=\"\",\"\",IF(E15=\"Projekt bzw. BDA\",VLOOKUP(J15,G!$V$1:$W$100,2),INDEX(G!$C$2:$C$93,MATCH(Stammdaten!D15&Stammdaten!E15,G!$A$2:$A$93&G!$B$2:$B$93,0))))","v":""},"",{"$f":"IF(E15=\"Projekt bzw. BDA\",O15/100*I15*K15,IF(AND(E15=\"Diplomarbeit/Prüfer\",K15>=5),O15/100*I15*5,IF(AND(E15=\"Betreuung bis 5 FBA\",K15>=2),O15/100*I15*1,IF(AND(E15=\"Betreuung FBA/je Prüfer\",K15>=2),O15/100*I15*1,IF(K15<>\"\",(O15/100*I15*K15),IF(K15=\"\",\"\"))))))","v":""}]
{"$rows_left_out":286}
{"sheet":"Lehrerliste","index":1,"n_rows":5374,"n_cols":2,"rows_kept":5374,"cut":false,"hidden":true,"merged":[]}
["PersNr","Name"]
[90462151,"Lippoth Anna"]
[90462155,"Dekan Waltraud"]
[90462163,"Hofmeister Elisabeth"]
[90462171,"Mocher Hermine"]
[90462174,"Pucher Angelika"]
[90462175,"Stangl Gertraud"]
[90462178,"Scheiternig Katharina"]
[90462179,"Hubmann Irmgard"]
[90462188,"Zojer Maria"]
[90462189,"Pressinger Daniela, Mag."]
[90462190,"Lagger Doris"]
[90462196,"Maier Angelika, Dipl.-Päd."]
[90462203,"Troicher Roswitha"]
[90462205,"Wurzer Ingrid"]
{"$rows_left_out":5360}
{"sheet":"ZVA","index":2,"n_rows":300,"n_cols":15,"rows_kept":300,"cut":false,"hidden":false,"merged":[[295,0,295,3],[296,0,296,3],[297,0,297,3],[298,0,298,3],[299,0,299,3],[286,0,286,3],[287,0,287,3],[288,0,288,3],[289,0,289,3],[290,0,290,3],[291,0,291,3],[292,0,292,3],[293,0,293,3],[294,0,294,3],[277,0,277,3],[278,0,278,3],[279,0,279,3],[280,0,280,3],[281,0,281,3],[282,0,282,3],[283,0,283,3],[284,0,284,3],[285,0,285,3],[268,0,268,3],[269,0,269,3],[270,0,270,3],[271,0,271,3],[272,0,272,3],[273,0,273,3],[274,0,274,3],[275,0,275,3],[276,0,276,3],[259,0,259,3],[260,0,260,3],[261,0,261,3],[262,0,262,3],[263,0,263,3],[264,0,264,3],[265,0,265,3],[266,0,266,3],[267,0,267,3],[250,0,250,3],[251,0,251,3],[252,0,252,3],[253,0,253,3],[254,0,254,3],[255,0,255,3],[256,0,256,3],[257,0,257,3],[258,0,258,3],[7,0,7,3],[128,0,128,3],[129,0,129,3],[130,0,130,3],[131,0,131,3],[132,0,132,3],[133,0,133,3],[134,0,134,3],[135,0,135,3],[110,0,110,3],[111,0,111,3],[112,0,112,3],[113,0,113,3],[114,0,114,3],[115,0,115,3],[116,0,116,3],[117,0,117,3],[118,0,118,3],[101,0,101,3],[102,0,102,3],[103,0,103,3],[104,0,104,3],[105,0,105,3],[106,0,106,3],[136,0,136,3],[119,0,119,3],[120,0,120,3],[121,0,121,3],[122,0,122,3],[123,0,123,3],[124,0,124,3],[125,0,125,3],[126,0,126,3],[127,0,127,3],[109,0,109,3],[92,0,92,3],[93,0,93,3],[94,0,94,3],[95,0,95,3],[96,0,96,3],[97,0,97,3],[98,0,98,3],[99,0,99,3],[100,0,100,3],[83,0,83,3],[84,0,84,3],[85,0,85,3],[86,0,86,3],[87,0,87,3],[88,0,88,3],[89,0,89,3],[107,0,107,3],[108,0,108,3],[74,0,74,3],[75,0,75,3],[76,0,76,3],[77,0,77,3],[78,0,78,3],[79,0,79,3],[80,0,80,3],[81,0,81,3],[82,0,82,3],[34,0,34,3],[35,0,35,3],[36,0,36,3],[37,0,37,3],[38,0,38,3],[39,0,39,3],[40,0,40,3],[41,0,41,3],[42,0,42,3],[25,0,25,3],[26,0,26,3],[27,0,27,3],[28,0,28,3],[29,0,29,3],[30,0,30,3],[31,0,31,3],[32,0,32,3],[33,0,33,3],[16,0,16,3],[17,0,17,3],[18,0,18,3],[19,0,19,3],[20,0,20,3],[21,0,21,3],[22,0,22,3],[23,0,23,3],[24,0,24,3],[50,0,50,3],[51,0,51,3],[90,0,90,3],[91,0,91,3],[54,0,54,3],[55,0,55,3],[56,0,56,3],[57,0,57,3],[58,0,58,3],[59,0,59,3],[60,0,60,3],[61,0,61,3],[62,0,62,3],[63,0,63,3],[64,0,64,3],[65,0,65,3],[66,0,66,3],[67,0,67,3],[68,0,68,3],[69,0,69,3],[70,0,70,3],[71,0,71,3],[72,0,72,3],[73,0,73,3],[137,0,137,3],[138,0,138,3],[139,0,139,3],[140,0,140,3],[52,0,52,3],[53,0,53,3],[2,0,2,6],[0,0,0,6],[1,0,1,6],[8,0,8,3],[9,0,9,3],[10,0,10,3],[11,0,11,3],[12,0,12,3],[13,0,13,3],[14,0,14,3],[15,0,15,3],[43,0,43,3],[44,0,44,3],[45,0,45,3],[46,0,46,3],[47,0,47,3],[48,0,48,3],[49,0,49,3],[141,0,141,3],[142,0,142,3],[143,0,143,3],[144,0,144,3],[145,0,145,3],[146,0,146,3],[147,0,147,3],[148,0,148,3],[149,0,149,3],[150,0,150,3],[151,0,151,3],[152,0,152,3],[153,0,153,3],[154,0,154,3],[155,0,155,3],[156,0,156,3],[157,0,157,3],[158,0,158,3],[159,0,159,3],[160,0,160,3],[161,0,161,3],[162,0,162,3],[163,0,163,3],[164,0,164,3],[165,0,165,3],[166,0,166,3],[167,0,167,3],[168,0,168,3],[169,0,169,3],[170,0,170,3],[171,0,171,3],[172,0,172,3],[173,0,173,3],[174,0,174,3],[175,0,175,3],[176,0,176,3],[177,0,177,3],[178,0,178,3],[179,0,179,3],[180,0,180,3],[181,0,181,3],[182,0,182,3],[183,0,183,3],[184,0,184,3],[185,0,185,3],[186,0,186,3],[187,0,187,3],[188,0,188,3],[189,0,189,3],[190,0,190,3],[191,0,191,3],[192,0,192,3],[193,0,193,3],[194,0,194,3],[195,0,195,3],[196,0,196,3],[197,0,197,3],[198,0,198,3],[199,0,199,3],[200,0,200,3],[201,0,201,3],[202,0,202,3],[203,0,203,3],[204,0,204,3],[205,0,205,3],[206,0,206,3],[207,0,207,3],[208,0,208,3],[209,0,209,3],[210,0,210,3],[211,0,211,3],[212,0,212,3],[226,0,226,3],[227,0,227,3],[228,0,228,3],[229,0,229,3],[230,0,230,3],[213,0,213,3],[214,0,214,3],[215,0,215,3],[216,0,216,3],[217,0,217,3],[218,0,218,3],[219,0,219,3],[220,0,220,3],[221,0,221,3],[3,1,3,5],[249,0,249,3],[240,0,240,3],[241,0,241,3],[242,0,242,3],[243,0,243,3],[244,0,244,3],[245,0,245,3],[246,0,246,3],[247,0,247,3],[248,0,248,3],[231,0,231,3],[232,0,232,3],[233,0,233,3],[234,0,234,3],[235,0,235,3],[236,0,236,3],[237,0,237,3],[238,0,238,3],[239,0,239,3],[222,0,222,3],[223,0,223,3],[224,0,224,3],[225,0,225,3]]}
[]
[{"$f":"Stammdaten!C7","v":"Prüfungsentschädigung"},null,null,null,null,null,null,null,null,null,null,"BD-Zahl:"]
["Zahlungs- und Verrechnungsauftrag"]
[{"$f":"IFERROR(VLOOKUP(Stammdaten!B5,Schulen!Q:T,4,0),\"\")","v":""},{"$f":"Stammdaten!C5","v":""},null,null,null,null,{"$f":"SUM(G9:G299)","v":0},null,null,null,null,{"$f":"LEFT(L3,13)","v":""}]
["Kostenstelle","Lohnart","Datum","Auftrag","Geschäftsber.","Buchungskreis","Personalber.",null,null,null,null,{"$f":"RIGHT(L3,5)","v":""}]
[{"$f":"IF(Stammdaten!B8=\"\",Stammdaten!B5,Stammdaten!B8)","v":0},{"$f":"Stammdaten!B7","v":4811},{"$f":"Stammdaten!B6","v":"00:00:00"},{"$f":"Stammdaten!D8","v":""},3740,3000,60,null,null,null,null,{"$f":"L4&L5","v":""}]
[]
["Zu- und Vorname, akademischer Grad",null,null,null,"Personalnr.","Lohnart","Betrag",null,null,null,"Datum","Zuordnung","Kostenstelle","Auftrag"]
[{"$f":"IF(Pivot!A2=\"\",\"\",Pivot!A2)","v":""},null,null,null,{"$f":"IF(Pivot!B2=\"\",\"\",Pivot!B2)","v":""},{"$f":"IF(E9=\"\",\"\",$B$6)","v":""},{"$f":"IF(Pivot!C2=\"\",\"\",Pivot!C2)","v":""},null,null,null,{"$f":"IF(A9=\"\",\"\",$C$6)","v":""},{"$f":"IF(A9=\"\",\"\",$L$6)","v":""},{"$f":"IF(N9=\"\",\"\",$A$6)","v":""},{"$f":"IF(A9=\"\",\"\",$D$6)","v":""},{"$f":"IF(G9=\"\",\"\",\"z\")","v":""}]
[{"$f":"IF(Pivot!A3=\"\",\"\",Pivot!A3)","v":""},null,null,null,{"$f":"IF(Pivot!B3=\"\",\"\",Pivot!B3)","v":""},"",{"$f":"IF(Pivot!C3=\"\",\"\",Pivot!C3)","v":""},null,null,null,{"$f":"IF(A10=\"\",\"\",$C$6)","v":""},{"$f":"IF(A10=\"\",\"\",$L$6)","v":""},{"$f":"IF(N10=\"\",\"\",$A$6)","v":""},{"$f":"IF(A10=\"\",\"\",$D$6)","v":""},""]
[{"$f":"IF(Pivot!A4=\"\",\"\",Pivot!A4)","v":""},null,null,null,{"$f":"IF(Pivot!B4=\"\",\"\",Pivot!B4)","v":""},"",{"$f":"IF(Pivot!C4=\"\",\"\",Pivot!C4)","v":""},null,null,null,"","","","",""]
[{"$f":"IF(Pivot!A5=\"\",\"\",Pivot!A5)","v":""},null,null,null,{"$f":"IF(Pivot!B5=\"\",\"\",Pivot!B5)","v":""},"",{"$f":"IF(Pivot!C5=\"\",\"\",Pivot!C5)","v":""},null,null,null,"","","","",""]
[{"$f":"IF(Pivot!A6=\"\",\"\",Pivot!A6)","v":""},null,null,null,{"$f":"IF(Pivot!B6=\"\",\"\",Pivot!B6)","v":""},"",{"$f":"IF(Pivot!C6=\"\",\"\",Pivot!C6)","v":""},null,null,null,"","","","",""]
[{"$f":"IF(Pivot!A7=\"\",\"\",Pivot!A7)","v":""},null,null,null,{"$f":"IF(Pivot!B7=\"\",\"\",Pivot!B7)","v":""},"",{"$f":"IF(Pivot!C7=\"\",\"\",Pivot!C7)","v":""},null,null,null,"","","","",""]
[{"$f":"IF(Pivot!A8=\"\",\"\",Pivot!A8)","v":""},null,null,null,{"$f":"IF(Pivot!B8=\"\",\"\",Pivot!B8)","v":""},{"$f":"IF(E15=\"\",\"\",$B$6)","v":""},{"$f":"IF(Pivot!C8=\"\",\"\",Pivot!C8)","v":""},null,null,null,"","","","",""]
{"$rows_left_out":286}
{"sheet":"Tabelle5","index":3,"n_rows":0,"n_cols":0,"rows_kept":0,"cut":false,"hidden":true,"merged":[]}

{"sheet":"Prüfungskommissionen","index":4,"n_rows":5,"n_cols":6,"rows_kept":5,"cut":false,"hidden":true,"merged":[]}
[]
["Klasse","Art der Prüfung","Prüfungstätigkeit","Ausm.","Teilpr.","Kandid."]
["(Leer)","(Leer)","(Leer)","(Leer)"]
["(Leer) Ergebnis"]
["Gesamtergebnis"]

{"sheet":"test","index":5,"n_rows":8,"n_cols":10,"rows_kept":8,"cut":false,"hidden":true,"merged":[]}
[730153,42616,"Reifepr./Diplompr.","Vorsitz",1,"d",8,100,null,3]
[90042928,42616,"Reifepr./Diplompr.","Schulleiter/AV/fachk. LP",1,"d",8,100,null,2]
[77002,42614,"Reifepr./Diplompr.","Vorsitz/mdl. Kompens.",1,"d",8,100,null,3]
[1086226,42705,"Reifepr./Diplompr.","mündl. m. Schwerp./2 Prüfer",null,"e",8,100,null,8]
[730153,42614,"Reifepr./Diplompr.","Schulleiter/AV/fachk. LP",7,"d",8,100,null,4]
[730153,42614,"Reifepr./Diplompr.","Schulleit./AV/LP/mdl. Komp",7,"d",8,100,null,5]
[610044,42614,"Reifepr./Diplompr.","JV/FV/SK/LP/mdl. Komp.",7,"d",8,100,null,6]
[610044,42614,"Reifepr./Diplompr.","JV/FV/SK/LP/mdl. Komp.",7,"d",8,100,null,7]

{"sheet":"Pivot","index":6,"n_rows":1,"n_cols":3,"rows_kept":1,"cut":false,"hidden":true,"merged":[]}
["Zu- und Vorname, akad. Grad","Personal-Nr.","Summe von Gesamt"]

{"sheet":"Schulen","index":7,"n_rows":361,"n_cols":20,"rows_kept":361,"cut":false,"hidden":true,"merged":[]}
[201016,"BG/BRG Europagymnasium",null,2010161,4817,4818,"30W000000002",4811,"Prüfungsentschädigung",null,null,null,201016,"Mag. Sabine Wintschnig",{"$f":"VLOOKUP(M1,$A:$C,2,0)","v":"BG/BRG Europagymnasium"},null,201016,"Ogris","AHS","Kollmann"]
[201026,"BG/BRG Mössinger Straße ",null,2010261,4817,4818,"30W000000002",4817,"Abgelt. Zusatzqualifik.",null,null,null,201026,"Mag. Franz Furtschegger",{"$f":"VLOOKUP(M2,$A:$C,2,0)","v":"BG/BRG Mössinger Straße "},null,201026,"Ogris","AHS","Polluk"]
[201036,"BORG Klagenfurt",null,2010361,4817,4818,"30W000000002",4818,"Extern. (Berufsreifepr.)",null,null,null,201036,"Mag. Michael Seher ","BORG Klagenfurt",null,201036,"Ogris","AHS","Perchtaler"]
[201046,"BG/BRG Lerchenfeldstraße ",null,2010461,4817,4818,"30W000000002",null,null,null,null,null,201046,"Mag. Sabine Weber","BG/BRG Lerchenfeldstraße ",null,201046,"Ogris","AHS","Perchtaler"]
[201056,"BG/BRG \"Ingeborg Bachmann\"",null,2010561,4817,4818,"30W000000002",null,null,null,null,null,201056,"MMMag.Dr. Markus Krainz ","BG/BRG \"Ingeborg Bachmann\"",null,201056,"Ogris","AHS","Perchtaler"]
[201066,"BG für Slowenen",null,2010661,4817,4818,"30W000000002",null,null,null,null,null,201066,"Mag. Rosalia Kuchling ","BG für Slowenen",null,201066,"Ogris","AHS","Perchtaler"]
[201076,"BRG Klagenfurt-Viktring",null,2010761,4817,4818,"30W000000002",null,null,null,null,null,201076,"Mag.Dr. Gabriele Fenkart ","BRG Klagenfurt-Viktring",null,201076,"Ogris","AHS","Hrovat"]
[201086,"BG für Berufstätige",null,2010861,4817,4818,"30W000000002",null,null,null,null,null,201086,"Mag.Dr. Anneliese Theuermann ","BG für Berufstätige",null,201086,"Ogris","AHS","Perchtaler"]
[201106,"Priv. RG und ORG St. Ursula d. Diözese Gurk",null,2011061,4817,4818,"30W000000002",null,null,null,null,null,201106,"Mag. Hans Omann ","Priv. RG und ORG St. Ursula d. Diözese Gurk",null,201106,"Ogris","AHS","Polluk"]
[201419,"HBLA Klagenfurt",null,2014191,4817,4818,"30W000000002",null,null,null,null,null,201419,"Mag. Michaela Graßler","HBLA Klagenfurt",null,201419,"Dobrautz","HBLA","Hrovat"]
[201427,"HTBLA Klagenfurt Lastenstraße ",null,2014271,4817,4818,"30W000000002",null,null,null,null,null,201427,"Dr. Michael Archer ","HTBLA Klagenfurt Lastenstraße ",null,201427,"Dobrautz","HTL","Hrovat"]
[201438,"BHAK/BHASCH I Klagenfurt",null,2014381,4817,4818,"30W000000002",null,null,null,null,null,201438,"Mag. Franz Hudelist ","BHAK/BHASCH I Klagenfurt",null,201438,"Zager","HAK","Kollmann"]
[201448,"BHAK/BHASCH International",null,2014481,4817,4818,"30W000000002",null,null,null,null,null,201448,"Mag. Franz Hudelist ","BHAK/BHASCH International",null,201448,"Zager","HAK","Kollmann"]
[201469,"HLW f. wirtschaftliche Berufe des Kärntner Caritasverbandes",null,2014691,4817,4818,"30W000000002",null,null,null,null,null,201469,"Mag. Tanja Perchtold","HLW f. wirtschaftliche Berufe des Kärntner Caritasverbandes",null,201469,"Dobrautz","HBLA","Perchtaler"]
[201529,"FS f. Sozialberufe 2 ",null,2015291,4817,4818,"30W000000002",null,null,null,null,null,201529,"Mag. Wilfried Hude ","FS f. Sozialberufe 2 ",null,201529,"Dobrautz","HBLA","Perchtaler"]
{"$rows_left_out":347}
{"sheet":"G","index":8,"n_rows":201,"n_cols":31,"rows_kept":201,"cut":false,"hidden":true,"merged":[]}
["Art","Leistung","E-Betrag","Abg.2",null,null,"Spalte1",null,1,"Vorsitz",null,"Reifepr./Diplompr.","Vorpr. d. Reifepr./Diplompr./AP","Externistenreifeprüfung","Zulassungsprüfung z. Extern.RP","Sonst. Externistenprüfungen","Aufnahmeprüfung/Einstufungspr.","Kommissionelle Prüfungen/Kolloquien","Abschlussprüfung","Käsek./Jungbark./Weinsom.","BRP/LmM",1,{"$f":"$B$99","v":43.2},null,"Spalte1",null,null,null,1,null,"Kanditaden"]
["Reifepr./Diplompr.","Vorsitz",2.2999999999999998,null,null,1,"Reifepr./Diplompr.",null,1,"Schulleiter/AV",null,"Vorsitz","Vorsitz","Vorsitz","Vorsitz","Vorsitz","Vorsitz","Vorsitz (komm. Prüfung)","Vorsitz","Vorsitz","Vorsitz",2,{"$f":"$B$99","v":43.2},null,100,null,100,null,2,null,1]
["Reifepr./Diplompr.","Vorsitz/mdl. Kompens.",2.2999999999999998,null,null,2,"Vorpr. d. Reifepr./Diplompr./AP",null,1,"Jahrgangsvorstand",null,"Vorsitz/mdl. Kompens.","Fachvorst./fachk. LP","Schulleiter","Schriftführung","Vorsitz §3/7","mündlich ","mündlich","Vorsitz/mdl. Kompens.","schriftlich","Prüfer schriftl.",3,43.2,null,99,null,null,null,3,null,2]
["Reifepr./Diplompr.","Schulleiter/AV/fachk. LP",1.9,null,null,3,"Externistenreifeprüfung",null,1,"Klassenvorstand/FV/WL",null,"Schulleiter/AV/fachk. LP","Schriftführung","Schriftführung BHS","mündlich ","Prüfer mündl. VS","praktisch","schriftlich/graph./prakt.","Schulleiter/AV/LP","praktisch","Prüfer mündl.",4,43.2,null,98,null,null,null,4,null,3]
["Reifepr./Diplompr.","Schulleit./AV/LP/mdl. Komp",1.9,null,null,4,"Zulassungsprüfung z. Extern.RP",null,1,"Vorsitz",null,"Schulleit./AV/LP/mdl. Komp","mündlich ","Schriftführung AHS","schriftl. /graphisch/prakt.","Prüfer mündl. §3/7 VS","schriftlich/graph./prakt.","Schriftf./fachk. Beisitzer","Schulleit./AV/LP/mdl. Komp","sensorisch","Prüfer Fachb./Klausur.",5,43.2,null,97,null,null,null,5,null,4]
["Reifepr./Diplompr.","JV/FV/SK/LP",1.9,null,null,5,"Sonst. Externistenprüfungen",null,1,"Schulleiter/AV",null,"JV/FV/SK/LP","schriftl. /graphisch/prakt.","mündlich AHS",null,"Schriftführung",null,null,"KV/FV/SK/LP","Organisat. d. Prüfung/JP","Prüfer Fachb./Korrektur",6,43.2,null,96,null,null,null,6,null,5]
["Reifepr./Diplompr.","JV/FV/SK/LP/mdl. Komp.",1.9,null,null,6,"Aufnahms- u. Einstufungsprüfungen",null,1,"KV/Jahrgangsvorstand",null,"JV/FV/SK/LP/mdl. Komp.","Projekt bzw. BDA","mündlich BHS",null,"Schriftführung §3/7",null,null,"JV/FV/SK/LP/mdl. Komp.","Organisat. d. Prüfung/KK","Beisitzer",7,43.2,null,95,null,null,null,7,null,6]
["Reifepr./Diplompr.","Klassenvorstand",1.9,null,null,7,"Komm. Prüfung/Kolloquien",null,1,"Fachvorstand/WL",null,"Klassenvorstand",null,"mündlich Schwerpunkt",null,"Prüfer mündl./prakt. MS",null,null,"Beisitzer","Organisat. d. Prüfung/Weins.","Schriftführung",8,43.2,null,94,null,null,null,null,null,7]
["Reifepr./Diplompr.","Klassenvorst./mdl. Komp.",1.9,null,null,10,"Abschlussprüfung",null,null,null,null,"Klassenvorst./mdl. Komp.",null,"schriftllich ",null,"Prüfer mündl./prakt. §3/7 MS",null,null,"Beisitzer mdl. Kompens.-Pr.",null,null,9,43.2,null,93,null,null,null,null,null,8]
["Reifepr./Diplompr.","schriftl. /graphisch/prakt.",24.5,null,null,null,"Bitte Lohnart und Prüfungsd. Eingeben",null,null,null,null,"schriftl. /graphisch/prakt.",null,"schriftl. - graf./prakt. AHS",null,"Prüfer schriftl. MS",null,null,"schriftl. /graphisch/prakt.",null,null,10,43.2,null,92,null,null,null,null,null,9]
["Reifepr./Diplompr.","schriftlich/standardisiert",13.6,null,null,null,null,null,null,null,null,"schriftlich/standardisiert",null,null,null,"Prüfer schriftl. §3/7 MS",null,null,"graphisch/prakt. Fachklaus.",null,null,11,{"$f":"W10+$C$99","v":47.5},null,91,null,null,null,null,null,10]
["Reifepr./Diplompr.","mündlich ",13.6,null,null,8,"Zertifikatsprüfung Käsek./Jungbark.",null,null,null,null,"mündlich ",null,null,null,null,null,null,"mdl. Kompensationspr.",null,null,12,{"$f":"W11+$C$99","v":51.8},null,90,null,null,null,null,null,11]
["Reifepr./Diplompr.","mündlich 2 Prüfer",10.5,null,null,8,"Zertifikatsprüfung Weinsommelier",null,null,null,null,"mündlich 2 Prüfer",null,null,null,null,null,null,"mündlich 2 Prüfer",null,null,13,56.099999999999994,null,89,null,null,null,null,null,12]
["Reifepr./Diplompr.","mündl. m. Schwerpunkt",18.3,null,null,null,null,null,null,null,null,"mündl. m. Schwerpunkt",null,null,null,null,null,null,"Korr. abschließende Arb.",null,null,14,60.399999999999991,null,88,null,null,null,null,null,13]
["Reifepr./Diplompr.","mündl. m. Schwerp./2 Prüfer",12.9,null,null,null,null,null,null,null,null,"mündl. m. Schwerp./2 Prüfer",null,null,null,null,null,null,"mündlich ",null,null,15,64.699999999999989,null,87,null,null,null,null,null,14]
{"$rows_left_out":187}
{"sheet":"Tabelle2","index":9,"n_rows":0,"n_cols":0,"rows_kept":0,"cut":false,"hidden":true,"merged":[]}

{"sheet":"Tabelle1","index":10,"n_rows":9,"n_cols":1,"rows_kept":9,"cut":false,"hidden":true,"merged":[]}
[]
["Vorsitz"]
["Direktor"]
["Klassenvorstand"]
["schriftlich"]
["praktisch/graphisch"]
["mündlich "]
["mündl. m. Schwerpunkt"]
["Schriftführung"]

{"sheet":"Tabelle3","index":11,"n_rows":0,"n_cols":0,"rows_kept":0,"cut":false,"hidden":true,"merged":[]}

{"sheet":"Tabelle4","index":12,"n_rows":10,"n_cols":1,"rows_kept":10,"cut":false,"hidden":true,"merged":[]}
[90233500]
[90054133]
[730153]
[610044]
[610044]
[211580]
[211580]
[191825]
[77002]
[77002]